{"text_format":"1","workbook":"xlsx","n_sheets":8,"sheets":["Instructions","I. Project Configuration","II. Technical Validation","III. Power Flow Model","IV. Dynamic Model","V. IR Validation & Comments","Version Control","Choices - to be hidden"],"not_rendered":{"charts":2,"images":2,"macros":1,"external_links":0,"defined_names":76,"comments":0,"pivot_tables":0},"unopened":[],"bounds":{"document_bytes":16777216,"sheet_cells":100000,"rows_first":2000,"rows_last":500,"rows_between":2000,"halvings":0,"cell_chars":16384,"cell_head_chars":4096},"cells_cut":0,"cells_raw":0,"read":"whole","date_system":"1900"}

{"sheet":"Instructions","index":0,"n_rows":71,"n_cols":3,"rows_kept":71,"cut":false,"hidden":false,"merged":[[59,1,59,2],[60,1,60,2],[62,1,62,2],[56,1,56,2],[23,0,23,2],[36,1,36,2],[37,1,37,2],[35,1,35,2],[28,0,28,2],[30,0,30,2],[33,1,33,2],[42,1,42,2],[44,1,44,2],[43,1,43,2],[38,1,38,2],[54,1,55,2],[70,1,70,2],[67,1,67,2],[65,1,65,2],[47,1,47,2],[66,1,66,2],[68,1,68,2],[69,1,69,2],[61,1,61,2],[64,1,64,2],[63,1,63,2],[58,0,58,2],[57,0,57,2],[52,1,52,2],[49,1,49,2],[50,1,50,2],[51,1,51,2],[0,0,3,2],[26,0,26,2],[31,1,31,2],[32,1,32,2],[24,0,24,2],[7,0,7,2],[22,0,22,2],[29,0,29,2],[8,0,8,2],[14,0,14,2],[9,0,13,0],[16,0,21,0],[15,0,15,1],[27,0,27,2],[4,0,6,1],[25,0,25,2],[54,0,55,0],[53,1,53,2],[39,1,39,2],[41,1,41,2],[48,1,48,2],[40,1,40,2],[45,1,45,2],[46,1,46,2]]}
["Attachment A, Generating Facility Data \nto GIDAP Appendix 1 Interconnection Request \n\nGENERATING FACILITY DATA"]
[]
[]
[]
[" ",null,"CAISO Public Document"]
[null,null,"Version: SAMPLE WIND"]
[null,null,"Last Updated: March 15, 2019"]
[" "]
["Project Information Completed by Interconnection Customer (Must match Appendix 1)"]
[null,"Project Name","Sample Wind IR"]
[null,"Q# (if assigned)",1234]
[null,"Interconnection Customer Name","ABC, Inc."]
[null,"Interconnection Customer Contact","John Doe"]
[null,"Requested Point of Interconnection (POI)","McMicken Substation 750kV"]
["Please read the instructions below!"]
["Table of Contents",null,"Descriptions"]
[null,"Instructions","Project Specific Information (above) & Guidelines for this document"]
[null,"I. Project Configuration","Project Data Input "]
[null,"II. Technical Validation","Validation Calcs based on Project Data input on Tab I."]
[null,"III. Power Flow Model","Power Flow Model Tool"]
{"$rows_left_out":52}
{"sheet":"I. Project Configuration","index":1,"n_rows":425,"n_cols":17,"rows_kept":425,"cut":false,"hidden":false,"merged":[[163,5,163,6],[162,11,162,12],[156,4,159,4],[156,1,159,3],[248,0,250,0],[284,1,284,3],[297,4,300,4],[318,1,318,3],[305,1,305,3],[168,0,169,0],[171,0,174,0],[175,0,178,0],[179,0,182,0],[183,0,186,0],[200,3,200,13],[183,2,186,3],[183,1,186,1],[188,9,191,10],[175,4,178,4],[171,5,174,6],[188,0,191,0],[188,5,191,6],[179,9,182,10],[203,6,203,12],[205,6,205,12],[268,1,268,3],[274,1,274,3],[297,8,297,10],[319,1,319,3],[315,1,315,3],[306,1,306,3],[300,5,300,13],[346,1,346,8],[332,0,334,0],[337,0,339,0],[322,2,322,3],[332,1,334,1],[336,1,336,3],[324,1,324,3],[325,1,326,1],[325,2,325,3],[326,2,326,3],[344,1,344,3],[311,1,311,3],[302,1,302,3],[315,5,315,13],[310,5,310,13],[319,12,326,13],[319,9,326,10],[304,1,304,3],[316,1,316,3],[317,1,317,3],[314,1,314,3],[301,1,301,3],[298,1,298,3],[263,8,263,10],[264,8,264,10],[263,11,263,13],[264,11,264,13],[297,1,297,3],[297,5,297,7],[310,1,310,3],[295,1,295,13],[294,1,294,13],[276,5,276,13],[281,1,281,3],[286,2,286,3],[288,2,288,3],[267,1,267,3],[264,1,264,3],[289,2,289,3],[269,1,269,3],[2,14,2,16],[233,7,234,10],[233,6,234,6],[93,1,93,3],[94,1,94,3],[41,10,42,10],[41,11,42,11],[24,1,24,3],[26,1,26,3],[41,1,42,3],[41,4,42,4],[41,5,42,5],[41,6,42,6],[41,7,42,7],[175,9,178,10],[175,11,178,12],[212,11,212,12],[41,8,42,8],[25,1,25,3],[45,2,46,3],[45,10,46,10],[91,13,92,13],[74,10,75,10],[110,1,110,3],[192,0,195,0],[196,0,199,0],[175,1,178,1],[95,1,95,3],[168,1,169,3],[91,0,92,0],[188,1,191,1],[188,2,191,3],[148,0,151,0],[152,0,155,0],[156,0,159,0],[161,2,161,3],[162,2,162,3],[163,2,163,3],[164,2,164,3],[129,1,129,3],[130,1,130,3],[131,1,131,3],[126,1,126,3],[148,1,151,3],[166,1,166,3],[143,1,143,13],[128,1,128,3],[147,7,147,8],[10,0,11,0],[74,0,75,0],[76,0,77,0],[80,0,81,0],[82,0,83,0],[12,1,12,13],[45,0,46,0],[45,7,46,7],[45,8,46,8],[56,0,57,0],[47,1,47,2],[47,3,47,13],[56,1,57,3],[56,5,57,5],[56,6,57,6],[56,7,57,7],[56,8,57,8],[80,13,81,13],[68,1,68,3],[76,1,77,3],[72,1,72,3],[73,1,73,3],[74,8,75,8],[69,1,69,3],[138,1,138,3],[139,2,140,2],[141,1,141,13],[147,9,147,10],[147,13,199,13],[163,9,163,10],[168,7,169,8],[168,9,169,10],[162,9,162,10],[168,5,169,6],[162,7,162,8],[171,9,174,10],[171,11,174,12],[164,5,164,6],[183,5,186,6],[161,9,161,10],[156,5,159,6],[152,5,155,6],[161,5,161,6],[161,1,164,1],[161,11,161,12],[160,1,160,3],[156,7,159,8],[156,9,159,10],[100,1,100,3],[171,7,174,8],[152,4,155,4],[192,7,195,8],[192,9,195,10],[156,11,159,12],[152,7,155,8],[152,9,155,10],[175,5,178,6],[188,4,191,4],[192,1,195,1],[192,11,195,12],[152,11,155,12],[163,7,163,8],[162,5,162,6],[161,7,161,8],[117,1,117,3],[148,7,151,8],[148,5,151,6],[145,6,146,13],[111,1,111,3],[104,2,105,2],[119,1,119,3],[145,4,146,4],[121,1,121,3],[120,1,120,3],[108,1,108,13],[103,1,103,3],[98,1,98,3],[88,1,88,3],[109,1,109,3],[115,1,115,3],[91,4,92,4],[91,6,92,6],[91,7,92,7],[106,1,106,13],[112,1,112,13],[113,1,113,13],[114,1,114,3],[91,9,92,9],[91,8,92,8],[118,1,118,3],[107,1,107,13],[97,1,97,13],[101,1,101,3],[102,1,102,3],[91,10,92,10],[99,1,99,3],[241,4,250,4],[242,1,243,2],[240,7,240,8],[216,9,216,10],[221,1,221,13],[216,5,216,6],[218,5,218,12],[222,1,222,13],[216,1,216,3],[236,11,236,12],[232,1,232,13],[236,4,238,4],[235,1,235,2],[248,1,250,3],[236,7,236,8],[236,9,236,10],[242,6,243,12],[227,4,230,4],[224,4,225,4],[216,7,216,8],[166,7,166,8],[166,9,166,10],[166,11,166,12],[223,1,223,13],[183,4,186,4],[179,4,182,4],[183,11,186,12],[215,11,215,12],[203,4,205,4],[206,1,206,3],[205,1,205,3],[215,5,215,6],[207,1,207,3],[208,1,208,3],[196,1,199,3],[196,4,199,4],[206,5,206,6],[210,11,210,12],[207,11,207,12],[213,11,213,12],[207,5,207,6],[217,7,217,8],[217,9,217,10],[215,9,215,10],[217,5,217,6],[217,1,217,3],[213,1,213,3],[122,1,122,3],[123,1,123,3],[124,1,124,3],[127,1,127,3],[145,1,146,3],[147,5,147,6],[214,5,214,6],[210,1,210,3],[212,1,212,3],[209,5,209,6],[210,5,210,6],[166,5,166,6],[215,1,215,3],[148,4,151,4],[152,1,155,3],[132,1,132,3],[133,1,133,3],[134,1,134,3],[135,1,135,3],[136,1,136,3],[137,1,137,3],[215,7,215,8],[213,7,213,8],[213,9,213,10],[213,5,213,6],[207,9,207,10],[214,1,214,3],[214,11,214,12],[208,11,208,12],[209,11,209,12],[211,11,211,12],[214,9,214,10],[207,7,207,8],[208,9,208,10],[209,7,209,8],[209,9,209,10],[211,9,211,10],[210,7,210,8],[211,5,211,6],[212,5,212,6],[211,7,211,8],[200,1,200,2],[196,11,199,12],[204,1,204,3],[204,5,204,12],[244,6,245,12],[49,1,49,3],[50,1,50,3],[60,1,60,3],[163,11,163,12],[164,7,164,8],[164,9,164,10],[80,12,81,12],[148,11,151,12],[145,5,146,5],[217,11,217,12],[236,5,236,6],[233,1,234,2],[224,2,225,3],[218,1,218,3],[216,11,216,12],[235,6,235,11],[201,1,201,13],[206,9,206,10],[202,1,202,13],[188,7,191,8],[203,1,203,3],[171,4,174,4],[175,2,178,3],[210,9,210,10],[209,1,209,3],[183,7,186,8],[183,9,186,10],[192,4,195,4],[192,5,195,6],[179,11,182,12],[179,7,182,8],[168,4,169,4],[170,5,170,12],[168,11,169,12],[175,7,178,8],[179,5,182,6],[403,1,403,9],[383,10,403,13],[264,5,264,7],[268,4,269,4],[281,5,281,13],[265,1,265,3],[276,1,276,3],[359,1,361,1],[357,1,357,3],[358,1,358,3],[354,1,356,1],[354,2,354,3],[356,2,356,3],[355,2,355,3],[359,2,359,3],[360,2,360,3],[332,5,334,10],[332,4,334,4],[353,1,353,3],[336,6,336,10],[280,1,280,3],[342,1,342,3],[296,1,296,3],[297,11,297,13],[380,3,380,13],[302,4,303,4],[424,1,425,7],[382,1,382,13],[383,1,383,3],[385,1,385,3],[386,1,386,3],[389,1,389,3],[398,1,398,3],[399,1,399,3],[400,1,400,3],[401,1,401,3],[402,1,402,3],[387,1,388,1],[390,1,391,1],[387,2,387,3],[420,1,422,7],[390,2,390,3],[389,5,389,9],[388,2,388,3],[391,2,391,3],[405,1,405,13],[408,1,411,7],[413,1,418,7],[408,9,422,10],[404,1,404,13],[393,2,393,3],[248,5,250,12],[240,5,240,6],[246,1,247,2],[237,1,241,2],[262,1,262,3],[273,1,273,3],[298,5,298,7],[298,8,298,10],[290,1,290,3],[285,6,292,7],[291,2,291,3],[244,1,245,2],[263,5,263,7],[291,1,292,1],[298,11,298,13],[283,1,283,3],[279,1,279,3],[286,1,289,1],[270,1,270,3],[271,1,271,3],[380,1,380,2],[26,4,28,4],[30,4,31,4],[32,3,32,13],[41,12,42,12],[1,1,1,3],[1,5,1,13],[59,1,59,13],[48,1,48,13],[67,1,67,13],[58,1,58,2],[58,3,58,13],[18,1,18,3],[27,1,28,2],[16,1,16,3],[44,1,44,3],[54,1,54,3],[61,4,65,4],[55,1,55,3],[2,1,2,13],[3,1,3,3],[9,1,9,3],[45,12,46,12],[45,13,46,13],[4,1,4,3],[5,1,5,3],[6,1,6,3],[7,1,7,3],[8,1,8,3],[13,1,13,13],[15,1,15,3],[17,1,17,3],[21,1,21,3],[22,1,22,3],[10,6,10,7],[10,4,11,4],[10,5,11,5],[14,1,14,3],[20,1,20,3],[19,1,19,3],[41,9,42,9],[38,1,38,3],[32,1,32,2],[56,11,57,11],[61,1,61,3],[62,1,62,3],[65,1,65,3],[71,1,71,3],[80,9,81,9],[80,1,81,3],[50,4,52,4],[66,3,66,13],[56,4,57,4],[52,2,52,3],[66,1,66,2],[56,13,57,13],[56,9,57,9],[56,10,57,10],[41,13,42,13],[45,1,46,1],[80,10,81,10],[80,8,81,8],[80,6,81,6],[45,11,46,11],[43,1,43,3],[84,1,85,1],[84,2,84,3],[80,7,81,7],[74,13,75,13],[73,4,77,4],[76,13,77,13],[74,1,75,3],[74,5,75,5],[74,6,75,6],[74,7,75,7],[76,7,77,7],[79,1,79,3],[80,5,81,5],[82,1,83,3],[85,2,85,3],[74,9,75,9],[74,11,75,11],[74,12,75,12],[56,12,57,12],[63,1,63,3],[64,2,64,3],[51,1,51,3],[45,9,46,9],[39,1,39,3],[40,1,40,3],[261,1,261,13],[224,5,225,12],[240,11,240,12],[212,7,212,8],[91,11,92,11],[91,12,92,12],[15,4,22,4],[30,1,30,3],[31,1,31,3],[36,1,36,3],[29,1,29,3],[35,1,35,13],[37,1,37,3],[241,9,241,10],[241,11,241,12],[44,4,46,4],[125,1,125,3],[116,1,116,3],[179,2,182,3],[179,1,182,1],[227,5,230,12],[219,2,219,3],[287,2,287,3],[164,11,164,12],[196,5,199,6],[208,5,208,6],[208,7,208,8],[214,7,214,8],[212,9,212,10],[196,7,199,8],[196,9,199,10],[171,2,174,3],[260,1,260,13],[171,1,174,1],[211,1,211,3],[237,5,237,6],[237,7,237,8],[237,9,237,10],[266,1,266,3],[227,2,230,3],[246,6,247,12],[272,1,272,3],[165,1,165,3],[188,11,191,12],[206,7,206,8],[192,2,195,3],[53,1,53,3],[45,6,46,6],[45,5,46,5],[91,1,92,3],[91,5,92,5],[96,1,96,3],[89,1,89,3],[80,4,83,4],[90,1,90,3],[87,1,87,3],[86,1,86,13],[78,1,78,13],[76,8,77,8],[76,9,77,9],[76,10,77,10],[76,5,77,5],[76,6,77,6],[76,11,77,11],[80,11,81,11],[76,12,77,12],[70,1,70,3],[148,9,151,10],[144,1,144,13],[147,1,147,3],[147,11,147,12],[239,7,239,8],[239,9,239,10],[239,11,239,12],[292,2,292,3],[285,1,285,3],[275,1,275,3],[278,1,278,3],[277,1,277,3],[282,1,282,3],[263,1,263,3],[266,5,266,13],[263,4,266,4],[259,1,259,13],[285,12,292,13],[285,9,292,10],[241,5,241,6],[240,9,240,10],[255,1,255,3],[241,7,241,8],[252,13,254,13],[378,1,378,3],[361,2,361,3],[367,2,367,3],[299,1,299,3],[300,1,300,3],[343,1,343,3],[352,1,352,3],[350,1,351,1],[350,2,350,3],[351,2,351,3],[323,2,323,3],[313,1,313,3],[347,1,347,3],[348,1,348,3],[345,1,345,3],[341,1,341,4],[307,1,307,3],[308,1,308,3],[312,1,312,3],[309,1,309,3],[303,1,303,3],[337,4,339,4],[349,1,349,3],[320,2,320,3],[371,1,371,3],[366,2,366,3],[145,0,146,0],[372,2,372,3],[368,4,368,8],[362,4,362,8],[363,2,363,3],[319,6,326,7],[331,6,331,10],[329,1,330,13],[320,1,323,1],[327,1,327,13],[349,5,349,8],[353,5,353,8],[337,5,339,10],[332,2,334,3],[337,1,339,1],[337,2,339,3],[321,2,321,3],[331,1,331,3],[328,1,328,13],[293,1,293,13],[284,5,284,13],[318,5,318,13],[396,1,397,1],[396,2,396,3],[397,2,397,3],[395,5,395,9],[364,2,364,3],[373,2,373,3],[369,2,369,3],[370,2,370,3],[358,4,358,8],[362,1,362,3],[365,1,365,3],[371,4,371,8],[381,1,381,13],[365,4,365,8],[368,1,368,3],[374,1,374,3],[375,1,375,3],[376,1,376,3],[392,1,392,3],[393,1,394,1],[394,2,394,3],[395,1,395,3],[379,1,379,8],[377,1,377,3],[0,0,0,13],[203,13,220,13],[251,1,251,13],[252,5,254,12],[256,1,256,3],[257,1,257,3],[252,1,254,3],[258,1,258,2],[219,5,219,6],[220,5,220,6],[220,7,220,8],[220,9,220,10],[220,11,220,12],[219,7,219,8],[219,9,219,10],[219,11,219,12],[206,11,206,12],[142,1,142,13],[33,0,34,13],[10,1,11,3],[23,1,23,3],[220,2,220,3],[237,11,237,12],[239,5,239,6]]}
[{"$f":"Instructions!C10","v":"Sample Wind IR"}]
["Item #",null,null,null,"UNITS"]
[null,"I. Overall Project MW Information",null,null,null,null,null,null,null,null,null,null,null,null,"Calculated values for validation. Do not enter here."]
["I.1","Total Generating Facility gross capacity",null,null,"MVA",{"$f":"SUMPRODUCT(F23:N23,F25:N25)","v":108}]
["I.2","Total Generating Facility gross output",null,null,"MW",101.64,"The gross MW output to achieve requested MW at POI",null,null,null,null,null,null,null,{"$f":"SUMPRODUCT(F23:N23,F26:N26)","v":108}]
["I.3","Generating Facility Auxiliary Load",null,null,"MW",0]
["I.4","Project net capacity at Generating Facility",null,null,"MW",{"$f":"F5-F6","v":101.64}]
["I.5","Anticipated Losses between the Generating Facility and POI",null,null,"MW",1.64,"Include all transformer and line losses between the generating units and the POI at total Generating Facility gross output as calculated by the power flow model in .epc file"]
["I.6","Desired net output at POI",null,null,"MW",{"$f":"F7-F8","v":100},"must match MW value derived from power flow model in .epc file"]
["I.7","Standby Load when Generating Facility is off-line",null,null,"MW",0]
["I.8","For combined cycle plants, specify the plant net output capacity for an outage of the steam turbine or an outage of a single combustion turbine",null,null,"MW"]
[]
[]
[null,"II. Individual Generating Facility Characteristics"]
["II.1","Generating Facility Name ",null,null,null,"Gen Type1","Gen Type2","Gen Type3","Gen Type5","Gen Type6","Gen Type7","Gen Type8","Gen Type9","Gen TypeX"]
["II.2","Technology",null,null,null,"Doubly Fed Asynchronous",null,null,null,null,null,null,null,null,{"$f":"COUNTA(vbaGenType)","v":1}]
["II.3","Type",null,null,null,"25: wind turbine (offshore)",null,null,null,null,null,null,null,null,1]
["II.4","Manufacturer",null,null,null,"WindM",null,null,null,null,null,null,null,null,1]
["II.5","Model Name",null,null,null,"WTGxxx-3",null,null,null,null,null,null,null,null,1]
["II.6","Model Number",null,null,null,null,null,null,null,null,null,null,null,null,0,"not required"]
{"$rows_left_out":406}
{"sheet":"II. Technical Validation","index":2,"n_rows":7,"n_cols":7,"rows_kept":7,"cut":false,"hidden":false,"merged":[[5,0,5,5],[1,0,4,2],[0,0,0,5]]}
[{"$f":"Instructions!C10","v":"Sample Wind IR"}]
[]
[]
[]
[]
["Data Error/Warning"]
["Type","Data Section","Data Item","Error/Warning Description","Entered Value","Suggested Changes","IC Explanation Regarding the Warning"]

{"sheet":"III. Power Flow Model","index":3,"n_rows":220,"n_cols":71,"rows_kept":220,"cut":false,"hidden":false,"merged":[[219,5,221,7],[75,0,75,6],[97,0,97,9],[219,0,221,4],[2,4,30,7],[146,0,146,10],[167,0,167,3],[56,0,56,1],[65,0,65,16],[58,7,63,10],[37,4,37,8],[46,4,46,8],[56,4,56,5],[178,0,178,5],[193,0,193,5],[0,0,0,12],[1,0,1,12],[32,0,32,2],[48,0,48,2],[39,0,39,2],[48,4,48,6],[2,0,2,3],[39,4,39,9],[32,4,32,8]]}
[{"$f":"Instructions!C10","v":"Sample Wind IR"}]
["Project Connectivity",null,null,null,null,null,null,null,null,null,null,null,null,null,null,null,null,null,"Hidden calculations",null,null,null,null,null,null,null,null,null,null,null,null,null,null,null,null,null,null,null,null,null,null,null,null,null,null,null,null,null,null,null,null,null,null,null,null,null,null,null,null,null,null,null,null,null,null,null,null,null,null,1.05,0.95]
["Buses",null,null,null,"\nSample One-Line Diagram"]
[null,"Bus Name","Bus Voltage","Bus No"]
["Point of Interconnection",null,{"$f":"'I. Project Configuration'!F343","v":230},1]
[]
["High Side of GSU",null,{"$f":"C5","v":230},2]
[]
["Low Side of GSU 1",null,{"$f":"'I. Project Configuration'!G272","v":34.5},3]
["Low Side of GSU 2",null,null,4]
["Low Side of GSU 3",null,null,5]
[]
["Feeder 1",null,{"$f":"IF(ISBLANK('I. Project Configuration'!F$386),\"\",'I. Project Configuration'!F$386)","v":34.5},6]
["Feeder 2",null,{"$f":"IF(ISBLANK('I. Project Configuration'!G$386),\"\",'I. Project Configuration'!G$386)","v":""},7]
["Feeder 3",null,{"$f":"IF(ISBLANK('I. Project Configuration'!H$386),\"\",'I. Project Configuration'!H$386)","v":""},8]
["Feeder 4",null,{"$f":"IF(ISBLANK('I. Project Configuration'!I$386),\"\",'I. Project Configuration'!I$386)","v":""},9]
["Feeder 5",null,{"$f":"IF(ISBLANK('I. Project Configuration'!J$386),\"\",'I. Project Configuration'!J$386)","v":""},10]
[]
["EQ Gen 1",null,null,15]
["EQ Gen 2",null,null,16]
{"$rows_left_out":201}
{"sheet":"IV. Dynamic Model","index":4,"n_rows":176,"n_cols":18,"rows_kept":176,"cut":false,"hidden":false,"merged":[[177,0,180,5],[8,7,19,9],[25,7,36,9],[124,11,124,12],[21,6,22,6],[153,6,154,9],[24,7,24,8],[23,0,23,5],[83,0,83,5],[122,0,122,5],[36,6,39,6],[40,6,42,6],[0,0,0,9],[124,13,124,17],[152,11,152,12],[152,13,152,17],[123,6,124,9],[65,6,80,6],[81,6,82,6],[150,0,150,5],[1,11,1,17],[1,0,1,5]]}
[{"$f":"Instructions!C10","v":"Sample Wind IR"}]
["Generator Model",null,null,null,null,null,"Comment",null,null,null,null,"Do Not Write"]
["Generator",null,null,null,null,null,null,null,null,null,null,{"$f":"COUNTA(B3:F3)","v":0}]
["Generator Bus"]
["Model Name"]
["mva"]
["lvplsw"]
["rrpwr",null,null,null,null,null,null,"Disclaimer"]
["brkpt",null,null,null,null,null,null,"This DYD tool helps to create an initial draft of several commonly used dynamic models for inverter based generators. It does not inclue all the models comprehensively. Use discretion when using the tool. The models that are not supported by the tool must be created without using the tool.\n\nThe models shall be tested with GE PSLF software.\n\nThe PRC-024 verification tool is for a quick check of the frequency/voltage ride-through settings. It shall not be interpreted as PRC-024 compliance indicator."]
["zerox"]
["lvpl1"]
["vtmax"]
["lvpnt1"]
["lvpnt0"]
["qmin"]
["accel"]
["tg"]
["tfltr"]
["iqrmax"]
["iqrmin"]
{"$rows_left_out":157}
{"sheet":"V. IR Validation & Comments","index":5,"n_rows":189,"n_cols":16,"rows_kept":189,"cut":false,"hidden":false,"merged":[[21,1,21,7],[24,1,24,7],[80,0,81,0],[80,1,81,7],[80,8,81,8],[82,0,84,8],[31,0,32,0],[177,1,177,7],[178,0,180,8],[128,0,129,8],[144,0,145,0],[144,1,145,7],[135,1,135,7],[53,0,55,8],[108,0,109,0],[108,1,109,7],[108,8,109,8],[98,8,99,8],[168,1,168,7],[169,0,171,8],[146,0,148,8],[48,1,48,7],[49,0,51,8],[27,1,27,7],[188,0,190,8],[76,1,76,7],[77,0,79,8],[174,0,176,8],[181,1,181,7],[182,0,184,8],[172,1,173,7],[172,0,173,0],[172,8,173,8],[149,1,149,7],[150,0,152,8],[153,1,153,7],[154,0,156,8],[132,0,134,8],[139,0,140,0],[139,1,140,7],[139,8,140,8],[141,0,143,8],[185,0,186,8],[89,1,89,7],[165,0,167,8],[160,0,162,8],[163,0,164,0],[163,1,164,7],[187,1,187,7],[118,0,119,0],[118,1,119,7],[118,8,119,8],[130,8,131,8],[45,0,47,8],[44,1,44,7],[37,0,39,8],[103,0,104,0],[103,1,104,7],[103,8,104,8],[105,0,107,8],[85,1,85,7],[86,0,88,8],[125,0,127,8],[113,0,114,0],[113,1,114,7],[113,8,114,8],[56,1,56,7],[57,0,59,8],[72,1,72,7],[73,0,75,8],[159,1,159,7],[18,8,19,8],[66,0,67,8],[20,1,20,7],[41,0,43,8],[100,0,102,8],[40,1,40,7],[130,0,131,0],[130,1,131,7],[123,8,124,8],[31,1,32,7],[31,8,32,8],[33,0,35,8],[52,1,52,7],[25,0,26,8],[115,0,117,8],[120,0,122,8],[123,0,124,0],[123,1,124,7],[60,0,61,8],[62,1,62,7],[63,0,65,8],[90,0,92,8],[93,0,94,0],[28,0,30,8],[163,8,164,8],[136,0,138,8],[144,8,145,8],[93,1,94,7],[93,8,94,8],[95,0,97,8],[110,0,112,8],[68,1,68,7],[69,0,71,8],[98,0,99,0],[98,1,99,7],[157,0,158,8],[1,0,1,8],[1,10,1,17],[2,10,5,17],[6,10,6,17],[7,11,7,12],[7,13,7,17],[11,11,11,12],[11,13,11,17],[12,13,12,17],[6,0,7,2],[6,3,7,5],[8,0,9,8],[10,1,10,7],[13,13,13,17],[12,11,12,12],[13,11,13,12],[2,0,5,8],[14,11,14,12],[14,13,14,17],[15,11,15,12],[15,13,15,17],[8,11,8,12],[8,13,8,17],[9,11,9,12],[6,6,7,8],[9,13,9,17],[10,11,10,12],[10,13,10,17],[13,1,13,7],[14,1,14,7],[16,10,16,17],[33,10,33,17],[49,15,49,17],[50,10,59,17],[62,11,62,12],[62,13,62,14],[62,15,62,17],[35,15,35,17],[36,10,45,17],[48,11,48,12],[48,13,48,14],[48,15,48,17],[35,10,35,14],[49,10,49,14],[19,15,19,17],[20,10,31,17],[34,11,34,12],[34,13,34,14],[34,15,34,17],[17,10,17,17],[18,11,18,12],[18,13,18,14],[18,15,18,17],[105,10,105,14],[105,15,105,17],[106,10,115,17],[76,13,76,14],[76,15,76,17],[63,15,63,17],[63,10,63,14],[64,10,73,17],[76,11,76,12],[77,10,77,14],[77,15,77,17],[78,10,87,17],[104,13,104,14],[104,15,104,17],[90,13,90,14],[90,15,90,17],[90,11,90,12],[91,10,91,14],[91,15,91,17],[92,10,101,17],[104,11,104,12],[160,13,160,14],[160,15,160,17],[161,10,161,14],[161,15,161,17],[162,10,171,17],[118,11,118,12],[118,13,118,14],[118,15,118,17],[119,10,119,14],[119,15,119,17],[120,10,129,17],[132,11,132,12],[132,13,132,14],[132,15,132,17],[133,10,133,14],[133,15,133,17],[134,10,143,17],[0,0,0,17],[174,11,174,12],[174,13,174,14],[174,15,174,17],[175,10,175,14],[176,10,185,17],[19,10,19,14],[11,1,11,7],[12,1,12,7],[22,1,22,7],[23,1,23,7],[15,1,15,7],[16,1,16,7],[17,1,17,7],[18,1,19,7],[36,1,36,7],[175,15,175,17],[146,11,146,12],[146,13,146,14],[146,15,146,17],[147,10,147,14],[147,15,147,17],[148,10,157,17],[160,11,160,12]]}
[{"$f":"Instructions!C10","v":"Sample Wind IR"}]
["Customer Confirmation & Validation Checklist",null,null,null,null,null,null,null,null,null,"Comment & Validation Tracking"]
["The following section is intended for:\n1) the Interconnection Customer to review and ensure all items are included and tasks are complete prior to submitting this form for IR validation.\n2) the CAISO and PTO to review the data and attachments for completeness and sufficient to consider the IR valid.",null,null,null,null,null,null,null,null,null,"The following section is intended to identify and track comments and recommendations to and from the parties involved in the IR Validation process.  \nDO NOT DELETE OR CHANGE PREVIOUS COMMENTS. "]
[]
[]
[]
["Customer Confirmation",null,null,"Objective is All Answers = Yes or N/A",null,null,"CAISO & PTO Review",null,null,null,"Version Control:"]
[null,null,null,null,null,null,null,null,null,null,"Date:","Reviewed By:",null,"Comment:"]
["Supporting Document Submittal Confirmation (see Instructions & I. Project Configuration Tabs for further details)"]
[]
["Yes","A completed application in the form of Appendix 1, Word doc including the Study agreement",null,null,null,null,null,null,"Choose"]
["Yes","Authorized signatory document and state of incorporation for the IC's company",null,null,null,null,null,null,"Choose"]
["Yes","Demonstration of Site Exclusivity or posting of a SE Deposit in lieu of",null,null,null,null,null,null,"Choose"]
["Yes","A load flow model",null,null,null,null,null,null,"Choose"]
["Yes","A dynamic data file",null,null,null,null,null,null,"Choose"]
["Yes","A reactive power capability document",null,null,null,null,null,null,"Choose"]
["Yes","Site Drawing showing POI AND Site Map with aerial imagery",null,null,null,null,null,null,"Choose"]
["Yes","A single-line diagram",null,null,null,null,null,null,"Choose",null,"Comments:"]
["Yes","A flat run plot and a bump test plot from the positive sequence transient stability simulation application",null,null,null,null,null,null,"Choose",null,"Date:","mm/dd/yyyy",null,"Commenter Name:"]
["Yes",null,null,null,null,null,null,null,null,null,"Representing:",null,null,null,null,"Choose One"]
{"$rows_left_out":170}
{"sheet":"Version Control","index":6,"n_rows":6,"n_cols":4,"rows_kept":6,"cut":false,"hidden":false,"merged":[[0,0,0,3]]}
["Version Tracking"]
["Date:","Verison:","Changes:","By who:"]
["2018-03-15","Intial Final","Initial version for use in Cluster 11","Foster/Zhu"]
["2018-04-03","c11.1","Fix three winding transformer calculation and a few labels","Zhu"]
["2019-03-08","c12.1","Enhancements based on Cluster 11 feedback","Zhu"]
["2019-03-11","C12.2","Fix transformer selection on Power Flow Model ","Zhu"]

{"sheet":"Choices - to be hidden","index":7,"n_rows":124,"n_cols":7,"rows_kept":124,"cut":false,"hidden":true,"merged":[]}
["Type","Choose One",null,"Y/N","Choose One",null,"Choose One"]
[null,"Induction",null,null,"Yes",null,"Yes; explain below"]
[null,"Synchronous",null,null,"No",null,"No; explain below"]
[null,"DC With Inverter",null,null,"N/A"]
[null,"Doubly Fed Asynchronous"]
["Phase","Choose One",null,"Y/N","Choose One"]
[null,"Single Phase",null,null,"Yes (See Below)",null,"Choose"]
[null,"Three Phase",null,null,"No",null,"Yes"]
[null,null,null,null,"N/A",null,"No"]
["Connection","Choose One",null,null,null,null,"N/A"]
[null,"Delta"]
[null,"Grounded WYE",null,"Representing","Choose One",null,"Insert Notes Here:"]
[null,"Ungrounded WYE",null,null,"CAISO"]
[null,"Impedance Grounded",null,null,"PTO"]
[null,null,null,null,"Customer"]
[]
["X"]
[null,"X",null,"Turbine Type","Choose One"]
[null,null,null,null,"Type 1","ES source of charging","transmission grid"]
[null,null,null,null,"Type 2",null,"distribution grid"]
{"$rows_left_out":104}